Target
Adenosine receptor A3
Ligand
BDBM50170941
Substrate
Meas. Tech.
ChEMBL_303601 (CHEMBL829690)
Ki
9±n/a nM
Citation
 Baraldi, PGTabrizi, MAPreti, DBovero, AFruttarolo, FRomagnoli, RZaid, NAMoorman, ARVarani, KBorea, PA New 2-arylpyrazolo[4,3-c]quinoline derivatives as potent and selective human A3 adenosine receptor antagonists. J Med Chem 48:5001-8 (2005)  
Target
Name:
Adenosine receptor A3
Synonyms:
A3 adenosine receptor (hA3) ADORA3 | Adenosine A3 receptor (A3AR)
Type:
G Protein-Coupled Receptor (GPCR)
Mol. Mass.:
36197.32
Organism:
Homo sapiens (Human)
Description:
P0DMS8
Residue:
318
  
Inhibitor
Name:
BDBM50170941
Synonyms:
2-p-Tolyl-2,5-dihydro-pyrazolo[4,3-c]quinolin-4-one | CHEMBL188035
Type:
Small organic molecule
Emp. Form.:
C17H13N3O
Mol. Mass.:
275.3046
SMILES:
Cc1ccc(cc1)-n1cc2c(n1)c1ccccc1[nH]c2=O
: