Target
Sphingosine 1-phosphate receptor 1
Ligand
BDBM23164
Substrate
Meas. Tech.
ChEMBL_304341 (CHEMBL839767)
pH
7.4±n/a
EC50
22±n/a nM
Comments
extracted
Citation
 Albert, RHinterding, KBrinkmann, VGuerini, DMüller-Hartwieg, CKnecht, HSimeon, CStreiff, MWagner, TWelzenbach, KZécri, FZollinger, MCooke, NFrancotte, E Novel immunomodulator FTY720 is phosphorylated in rats and humans to form a single stereoisomer. Identification, chemical proof, and biological characterization of the biologically active species and its enantiomer. J Med Chem 48:5373-7 (2005)  
Target
Name:
Sphingosine 1-phosphate receptor 1
Synonyms:
CHEDG1 Endothelial differentiation G-protein coupled receptor 1 S1P1 S1PR1_HUMAN Sphingosine 1-phosphate receptor Edg-1
Type:
Enzyme
Mol. Mass.:
42836.02
Organism:
Homo sapiens (Human)
Description:
P21453
Residue:
382
  
Inhibitor
Name:
BDBM23164
Synonyms:
CHEMBL190006 [(2R)-2-amino-3-hydroxy-2-[2-(4-octylphenyl)ethyl]propoxy]phosphonic acid
Type:
Small organic molecule
Emp. Form.:
C19H34NO5P
Mol. Mass.:
387.4507
SMILES:
CCCCCCCCc1ccc(CC[C@@](N)(CO)COP(O)(O)=O)cc1
: