Target
Poly [ADP-ribose] polymerase 1
Ligand
BDBM50171731
Substrate
Meas. Tech.
ChEMBL_321272 (CHEMBL881278)
IC50
274±n/a nM
Citation
 Ishida, JHattori, KYamamoto, HIwashita, AMihara, KMatsuoka, N 4-Phenyl-1,2,3,6-tetrahydropyridine, an excellent fragment to improve the potency of PARP-1 inhibitors. Bioorg Med Chem Lett 15:4221-5 (2005)  
Target
Name:
Poly [ADP-ribose] polymerase 1
Synonyms:
(ARTD1 or PARP1) 2.4.2.30 ADPRT ARTD1 Human diphtheria toxin-like ADP-ribosyltransferase (ARTD1 or PARP1) NT-PARP-1 PARP1 PPOL Poly [ADP-ribose] polymerase 1 (PARP) Poly [ADP-ribose] polymerase 1 (PARP1) Poly [ADP-ribose] polymerase 1, 28-kDa form Poly [ADP-ribose] polymerase 1, processed C-terminus Poly [ADP-ribose] polymerase-1 Poly(ADP-ribose) polymerase-1 (ARTD1/PARP1) Protein poly-ADP-ribosyltransferase PARP1 | Synonyms=ADPRT
Type:
Mol. Mass.:
113114.22
Organism:
Homo sapiens (Human)
Description:
P09874
Residue:
1014
  
Inhibitor
Name:
BDBM50171731
Synonyms:
6-Methyl-2-[3-(4-phenyl-3,6-dihydro-2H-pyridin-1-yl)-propyl]-4a,5,6,7,8,8a-hexahydro-3H-quinazolin-4-one | CHEMBL198230
Type:
Small organic molecule
Emp. Form.:
C23H31N3O
Mol. Mass.:
365.5117
SMILES:
CC1CCC2NC(CCCN3CCC(=CC3)c3ccccc3)=NC(=O)C2C1
: