Target
Poly [ADP-ribose] polymerase 1
Ligand
BDBM50171748
Substrate
Meas. Tech.
ChEMBL_321272 (CHEMBL881278)
IC50
200±n/a nM
Citation
 Ishida, JHattori, KYamamoto, HIwashita, AMihara, KMatsuoka, N 4-Phenyl-1,2,3,6-tetrahydropyridine, an excellent fragment to improve the potency of PARP-1 inhibitors. Bioorg Med Chem Lett 15:4221-5 (2005)  
Target
Name:
Poly [ADP-ribose] polymerase 1
Synonyms:
(ARTD1 or PARP1) 2.4.2.30 ADPRT ARTD1 Human diphtheria toxin-like ADP-ribosyltransferase (ARTD1 or PARP1) NT-PARP-1 PARP1 PPOL Poly [ADP-ribose] polymerase 1 (PARP) Poly [ADP-ribose] polymerase 1 (PARP1) Poly [ADP-ribose] polymerase 1, 28-kDa form Poly [ADP-ribose] polymerase 1, processed C-terminus Poly [ADP-ribose] polymerase-1 Poly(ADP-ribose) polymerase-1 (ARTD1/PARP1) Protein poly-ADP-ribosyltransferase PARP1 | Synonyms=ADPRT
Type:
Mol. Mass.:
113114.22
Organism:
Homo sapiens (Human)
Description:
P09874
Residue:
1014
  
Inhibitor
Name:
BDBM50171748
Synonyms:
2-[3-(4-Phenyl-3,6-dihydro-2H-pyridin-1-yl)-propyl]-3,4a,5,7,8,8a-hexahydro-pyrano[4,3-d]pyrimidin-4-one | CHEMBL197469
Type:
Small organic molecule
Emp. Form.:
C21H27N3O2
Mol. Mass.:
353.458
SMILES:
O=C1N=C(CCCN2CCC(=CC2)c2ccccc2)NC2CCOCC12
: