Target
5-hydroxytryptamine receptor 2A
Ligand
BDBM50171885
Substrate
Meas. Tech.
ChEMBL_303813 (CHEMBL827072)
Ki
2600±n/a nM
Citation
 Fiorino, FPerissutti, ESeverino, BSantagada, VCirillo, DTerracciano, SMassarelli, PBruni, GCollavoli, ERenner, CCaliendo, G New 5-hydroxytryptamine(1A) receptor ligands containing a norbornene nucleus: synthesis and in vitro pharmacological evaluation. J Med Chem 48:5495-503 (2005)  
Target
Name:
5-hydroxytryptamine receptor 2A
Synonyms:
5-HT-2A 5-HT2A 5-hydroxytryptamine receptor 2A (5HT2A) Htr2 Serotonin Receptor 2A
Type:
G Protein-Coupled Receptor (GPCR)
Mol. Mass.:
52852.05
Organism:
Rattus norvegicus (rat)
Description:
Rat cortex membranes 5-HT2A receptors.
Residue:
471
  
Inhibitor
Name:
BDBM50171885
Synonyms:
4-{3-[4-(3-Trifluoromethyl-phenyl)-piperazin-1-yl]-propoxy}-4-aza-tricyclo[5.2.1.0*2,6*]dec-8-ene-3,5-dione | CHEMBL191226
Type:
Small organic molecule
Emp. Form.:
C23H26F3N3O3
Mol. Mass.:
449.466
SMILES:
FC(F)(F)c1cccc(c1)N1CCN(CCCON2C(=O)C3C4CC(C=C4)C3C2=O)CC1
: