Target
D(1A) dopamine receptor
Ligand
BDBM50171890
Substrate
Meas. Tech.
ChEMBL_303799 (CHEMBL829848)
Ki
>100000±n/a nM
Citation
 Fiorino, FPerissutti, ESeverino, BSantagada, VCirillo, DTerracciano, SMassarelli, PBruni, GCollavoli, ERenner, CCaliendo, G New 5-hydroxytryptamine(1A) receptor ligands containing a norbornene nucleus: synthesis and in vitro pharmacological evaluation. J Med Chem 48:5495-503 (2005)  
Target
Name:
D(1A) dopamine receptor
Synonyms:
DOPAMINE D1 Dopamine D1 high Dopamine receptor Dopamine1-like Drd1a
Type:
Enzyme Catalytic Domain
Mol. Mass.:
49429.75
Organism:
RAT
Description:
P18901
Residue:
446
  
Inhibitor
Name:
BDBM50171890
Synonyms:
4-{2-[4-(2-Chloro-phenyl)-piperazin-1-yl]-ethoxy}-4-aza-tricyclo[5.2.1.0*2,6*]dec-8-ene-3,5-dione | CHEMBL426813
Type:
Small organic molecule
Emp. Form.:
C21H24ClN3O3
Mol. Mass.:
401.887
SMILES:
Clc1ccccc1N1CCN(CCON2C(=O)C3C4CC(C=C4)C3C2=O)CC1
: