Target
Aldo-keto reductase family 1 member A1
Ligand
BDBM16312
Substrate
Meas. Tech.
ChEMBL_306703 (CHEMBL830860)
IC50
4000±n/a nM
Citation
 El-Kabbani, OCarbone, VDarmanin, COka, MMitschler, APodjarny, ASchulze-Briese, CChung, RP Structure of aldehyde reductase holoenzyme in complex with the potent aldose reductase inhibitor fidarestat: implications for inhibitor binding and selectivity. J Med Chem 48:5536-42 (2005)  
Target
Name:
Aldo-keto reductase family 1 member A1
Synonyms:
AK1A1_PIG ALR Aldehyde reductase
Type:
PROTEIN
Mol. Mass.:
36557.09
Organism:
Sus scrofa
Description:
ChEMBL_615076
Residue:
325
  
Inhibitor
Name:
BDBM16312
Synonyms:
(4S)-6-fluoro-2,3-dihydrospiro[1-benzopyran-4,4'-imidazolidine]-2',5'-dione Sorbinil
Type:
Small organic molecule
Emp. Form.:
C11H9FN2O3
Mol. Mass.:
236.1992
SMILES:
Fc1ccc2OCC[C@]3(NC(=O)NC3=O)c2c1
: