Target
Mu-type opioid receptor
Ligand
BDBM50172017
Substrate
Meas. Tech.
ChEMBL_312623 (CHEMBL834112)
IC50
1887±n/a nM
Citation
 Balboni, GCocco, MTSalvadori, SRomagnoli, RSasaki, YOkada, YBryant, SDJinsmaa, YLazarus, LH From the potent and selective mu opioid receptor agonist H-Dmt-d-Arg-Phe-Lys-NH(2) to the potent delta antagonist H-Dmt-Tic-Phe-Lys(Z)-OH. J Med Chem 48:5608-11 (2005)  
Target
Name:
Mu-type opioid receptor
Synonyms:
M-OR-1 Mu opioid receptor OPIATE Mu OPRM_CAVPO
Type:
Enzyme Catalytic Domain
Mol. Mass.:
11165.58
Organism:
GUINEA PIG
Description:
P97266
Residue:
98
  
Inhibitor
Name:
BDBM50172017
Synonyms:
CHEMBL3143756 | {(S)-5-[(S)-2-({2-[2-Amino-3-(4-hydroxy-2,6-dimethyl-phenyl)-propionyl]-1,2,3,4-tetrahydro-isoquinoline-3-carbonyl}-amino)-3-phenyl-propionylamino]-5-carbamoyl-pentyl}-carbamic acid benzyl ester
Type:
Small organic molecule
Emp. Form.:
C44H52N6O7
Mol. Mass.:
776.9197
SMILES:
Cc1cc(O)cc(C)c1C[C@H](N)C(=O)N1Cc2ccccc2C[C@H]1C(=O)N[C@@H](Cc1ccccc1)C(=O)N[C@@H](CCCCNC(=O)OCc1ccccc1)C(N)=O
: