Target
5-hydroxytryptamine receptor 6
Ligand
BDBM34148
Substrate
Meas. Tech.
ChEMBL_320876 (CHEMBL884801)
Ki
1±n/a nM
Citation
 Cole, DCLennox, WJStock, JREllingboe, JWMazandarani, HSmith, DLZhang, GTawa, GJSchechter, LE Conformationally constrained N1-arylsulfonyltryptamine derivatives as 5-HT6 receptor antagonists. Bioorg Med Chem Lett 15:4780-5 (2005)  
Target
Name:
5-hydroxytryptamine receptor 6
Synonyms:
5-HT-6 5-hydroxytryptamine receptor 6 (5-HT-6) 5-hydroxytryptamine receptor 6 (5HT6) HTR6 Serotonin 6 (5-HT6) receptor | Serotonin Receptor 6
Type:
G Protein-Coupled Receptor (GPCR)
Mol. Mass.:
46968.43
Organism:
Homo sapiens (Human)
Description:
P50406
Residue:
440
  
Inhibitor
Name:
BDBM34148
Synonyms:
CHEMBL371292 | piperidinylindole, 7
Type:
Small organic molecule
Emp. Form.:
C19H20N2O2S
Mol. Mass.:
340.439
SMILES:
O=S(=O)(c1ccccc1)n1cc(C2CCCNC2)c2ccccc12
: