Target
Melanin-concentrating hormone receptor 1
Ligand
BDBM50172429
Substrate
Meas. Tech.
ChEMBL_321618 (CHEMBL871627)
IC50
0.92±n/a nM
Citation
 Ulven, TFrimurer, TMReceveur, JMLittle, PBRist, ONørregaard, PKHögberg, T 6-Acylamino-2-aminoquinolines as potent melanin-concentrating hormone 1 receptor antagonists. Identification, structure-activity relationship, and investigation of binding mode. J Med Chem 48:5684-97 (2005)  
Target
Name:
Melanin-concentrating hormone receptor 1
Synonyms:
G-protein coupled receptor 24 MCH receptor 1 MCH-R1 MCHR-1 MCHR1_HUMAN Melanin-Concentrating Hormone Receptor 1 (MCH1R) Melanin-concentrating hormone receptor 1 (MCH-1) Melanin-concentrating hormone receptor 1 (MCHR-1) SLC-1 Somatostatin receptor-like protein
Type:
G Protein-Coupled Receptor (GPCR)
Mol. Mass.:
45976.27
Organism:
Homo sapiens (Human)
Description:
Membranes from CHO-K1 cells stably expressing human MCH1R were used in assays.
Residue:
422
  
Inhibitor
Name:
BDBM50172429
Synonyms:
CHEMBL370120 | N-(4-Methyl-2-piperidin-1-yl-quinolin-6-yl)-2-(4-trifluoromethoxy-phenoxy)-acetamide
Type:
Small organic molecule
Emp. Form.:
C24H24F3N3O3
Mol. Mass.:
459.4609
SMILES:
Cc1cc(nc2ccc(NC(=O)COc3ccc(OC(F)(F)F)cc3)cc12)N1CCCCC1
: