Target
Melanin-concentrating hormone receptor 1
Ligand
BDBM50172441
Substrate
Meas. Tech.
ChEMBL_321618 (CHEMBL871627)
IC50
0.9±n/a nM
Citation
 Ulven, TFrimurer, TMReceveur, JMLittle, PBRist, ONørregaard, PKHögberg, T 6-Acylamino-2-aminoquinolines as potent melanin-concentrating hormone 1 receptor antagonists. Identification, structure-activity relationship, and investigation of binding mode. J Med Chem 48:5684-97 (2005)  
Target
Name:
Melanin-concentrating hormone receptor 1
Synonyms:
G-protein coupled receptor 24 MCH receptor 1 MCH-R1 MCHR-1 MCHR1_HUMAN Melanin-Concentrating Hormone Receptor 1 (MCH1R) Melanin-concentrating hormone receptor 1 (MCH-1) Melanin-concentrating hormone receptor 1 (MCHR-1) SLC-1 Somatostatin receptor-like protein
Type:
G Protein-Coupled Receptor (GPCR)
Mol. Mass.:
45976.27
Organism:
Homo sapiens (Human)
Description:
Membranes from CHO-K1 cells stably expressing human MCH1R were used in assays.
Residue:
422
  
Inhibitor
Name:
BDBM50172441
Synonyms:
(E)-N-{2-[(2-Hydroxy-ethyl)-methyl-amino]-4-methyl-quinolin-6-yl}-3-(4-trifluoromethoxy-phenyl)-acrylamide | CHEMBL197050
Type:
Small organic molecule
Emp. Form.:
C23H22F3N3O3
Mol. Mass.:
445.4343
SMILES:
CN(CCO)c1cc(C)c2cc(NC(=O)\C=C\c3ccc(OC(F)(F)F)cc3)ccc2n1
: