Target
5-hydroxytryptamine receptor 1A
Ligand
BDBM50173094
Substrate
Meas. Tech.
ChEMBL_320820 (CHEMBL872355)
Ki
882±n/a nM
Citation
 Huang, YBae, SARoth, BLLaruelle, M Synthesis of potent and selective serotonin 5-HT1B receptor ligands. Bioorg Med Chem Lett 15:4786-9 (2005)  
Target
Name:
5-hydroxytryptamine receptor 1A
Synonyms:
5-HT-1A 5-hydroxytryptamine receptor 1A (5-HT-1A) ADRB2RL1 Dopamine D2 receptor and serotonin 1a receptor HTR1A | Serotonin receptor 1A
Type:
Mol. Mass.:
46122.49
Organism:
Homo sapiens (Human)
Description:
Residue:
422
  
Inhibitor
Name:
BDBM50173094
Synonyms:
4-(4-Methylsulfanyl-phenyl)-piperazine-1-carboxylic acid [4-methoxy-3-(4-methyl-piperazin-1-yl)-phenyl]-amide | CHEMBL197796
Type:
Small organic molecule
Emp. Form.:
C24H33N5O2S
Mol. Mass.:
455.616
SMILES:
COc1ccc(NC(=O)N2CCN(CC2)c2ccc(SC)cc2)cc1N1CCN(C)CC1
: