Target
5-hydroxytryptamine receptor 7
Ligand
BDBM79215
Substrate
Meas. Tech.
ChEMBL_320882 (CHEMBL884807)
Ki
>10000±n/a nM
Citation
 Huang, YBae, SARoth, BLLaruelle, M Synthesis of potent and selective serotonin 5-HT1B receptor ligands. Bioorg Med Chem Lett 15:4786-9 (2005)  
Target
Name:
5-hydroxytryptamine receptor 7
Synonyms:
5-HT-7 5-HT7 5-HT7S 5HT7 HTR7 | Serotonin receptor 7
Type:
G Protein-Coupled Receptor (GPCR)
Mol. Mass.:
53573.08
Organism:
Homo sapiens (Human)
Description:
P34969
Residue:
479
  
Inhibitor
Name:
BDBM79215
Synonyms:
CHEMBL15928 GR 127935 hydrochloride hydrate N-[4-methoxy-3-(4-methyl-1-piperazinyl)phenyl]-4-[2-methyl-4-(5-methyl-1,2,4-oxadiazol-3-yl)phenyl]benzamide;hydrochloride N-[4-methoxy-3-(4-methylpiperazino)phenyl]-4-[2-methyl-4-(5-methyl-1,2,4-oxadiazol-3-yl)phenyl]benzamide;hydrochloride cid_11497466
Type:
Small organic molecule
Emp. Form.:
C29H31N5O3
Mol. Mass.:
497.5881
SMILES:
COc1ccc(NC(=O)c2ccc(cc2)-c2ccc(cc2C)-c2noc(C)n2)cc1N1CCN(C)CC1
: