Target
Peroxisome proliferator-activated receptor alpha
Ligand
BDBM50173365
Substrate
Meas. Tech.
ChEMBL_321484 (CHEMBL880425)
IC50
>15000±n/a nM
Citation
 Dropinski, JFAkiyama, TEinstein, MHabulihaz, BDoebber, TBerger, JPMeinke, PTShi, GQ Synthesis and biological activities of novel aryl indole-2-carboxylic acid analogs as PPARgamma partial agonists. Bioorg Med Chem Lett 15:5035-8 (2005)  
Target
Name:
Peroxisome proliferator-activated receptor alpha
Synonyms:
NR1C1 PPAR PPAR-alpha PPARA_HUMAN Peroxisome proliferator-activated receptor | Peroxisome proliferator-activated receptor alpha (PPAR alpha)
Type:
Enzyme
Mol. Mass.:
52222.08
Organism:
Homo sapiens (Human)
Description:
Q07869
Residue:
468
  
Inhibitor
Name:
BDBM50173365
Synonyms:
5-CHLORO-1-(4-CHLOROBENZYL)-3-(PHENYLTHIO)-1H-INDOLE-2-CARBOXYLIC ACID CHEMBL370152
Type:
Small organic molecule
Emp. Form.:
C22H15Cl2NO2S
Mol. Mass.:
428.331
SMILES:
OC(=O)c1c(Sc2ccccc2)c2cc(Cl)ccc2n1Cc1ccc(Cl)cc1
: