Target
Cathepsin S
Ligand
BDBM50240981
Substrate
Meas. Tech.
ChEMBL_321238 (CHEMBL881773)
IC50
>10000±n/a nM
Citation
 Black, WCBayly, CIDavis, DEDesmarais, SFalgueyret, JPLéger, SLi, CSMassé, FMcKay, DJPalmer, JTPercival, MDRobichaud, JTsou, NZamboni, R Trifluoroethylamines as amide isosteres in inhibitors of cathepsin K. Bioorg Med Chem Lett 15:4741-4 (2005)  
Target
Name:
Cathepsin S
Synonyms:
CATS_HUMAN Cathepsin S (Cat S) | cathepsin S preproprotein
Type:
Protein
Mol. Mass.:
37507.38
Organism:
Homo sapiens (Human)
Description:
P25774
Residue:
331
  
Inhibitor
Name:
BDBM50240981
Synonyms:
4'-piperazin-1-yl-biphenyl-4-carboxylic acid [1-(cyanomethyl-carbamoyl)-cyclohexyl]-amide | CHEMBL371133
Type:
Small organic molecule
Emp. Form.:
C26H31N5O2
Mol. Mass.:
445.5566
SMILES:
O=C(NC1(CCCCC1)C(=O)NCC#N)c1ccc(cc1)-c1ccc(cc1)N1CCNCC1
: