Target
Mitogen-activated protein kinase 14
Ligand
BDBM50173609
Substrate
Meas. Tech.
ChEMBL_321402 (CHEMBL880637)
IC50
7.1±n/a nM
Citation
 Miwatashi, SArikawa, YKotani, EMiyamoto, MNaruo, KKimura, HTanaka, TAsahi, SOhkawa, S Novel inhibitor of p38 MAP kinase as an anti-TNF-alpha drug: discovery of N-[4-[2-ethyl-4-(3-methylphenyl)-1,3-thiazol-5-yl]-2-pyridyl]benzamide (TAK-715) as a potent and orally active anti-rheumatoid arthritis agent. J Med Chem 48:5966-79 (2005)  
Target
Name:
Mitogen-activated protein kinase 14
Synonyms:
CSAID-binding protein CSBP1 CSPB1 MAP kinase 14 MAP kinase p38 alpha MAPK14 MK14_HUMAN Mitogen-activated protein kinase p38 alpha Stress-activated protein kinase 2a | p38 MAP kinase alpha/beta
Type:
Serine/threonine-protein kinase
Mol. Mass.:
41286.76
Organism:
Homo sapiens (Human)
Description:
Q16539
Residue:
360
  
Inhibitor
Name:
BDBM50173609
Synonyms:
CHEMBL363648 N-[4-(2-Ethyl-4-m-tolyl-thiazol-5-yl)-pyridin-2-yl]-benzamide | US10865384, Compound TAK-715
Type:
Small organic molecule
Emp. Form.:
C24H21N3OS
Mol. Mass.:
399.508
SMILES:
CCc1nc(c(s1)-c1ccnc(NC(=O)c2ccccc2)c1)-c1cccc(C)c1
: