Target
Carbonic anhydrase 1
Ligand
BDBM50173867
Substrate
Meas. Tech.
ChEMBL_320715 (CHEMBL881701)
Ki
85±n/a nM
Citation
 Innocenti, AVillar, RMartinez-Merino, VGil, MJScozzafava, AVullo, DSupuran, CT Carbonic anhydrase inhibitors: inhibition of cytosolic/tumor-associated carbonic anhydrase isozymes I, II, and IX with benzo[b]thiophene 1,1-dioxide sulfonamides. Bioorg Med Chem Lett 15:4872-6 (2005)  
Target
Name:
Carbonic anhydrase 1
Synonyms:
CA-I CAB Carbonate dehydratase I Carbonic anhydrase 1 (CA I) Carbonic anhydrase 1 (Recombinant CA I) Carbonic anhydrase B Carbonic anhydrase I (CA I) Carbonic anhydrase I (CAI) Carbonic anhydrase isoenzyme I (hCA I) | hCA
Type:
Enzyme
Mol. Mass.:
28873.37
Organism:
Homo sapiens (Human)
Description:
P00915
Residue:
261
  
Inhibitor
Name:
BDBM50173867
Synonyms:
3-Methyl-1,1-dioxo-1H-1lambda*6*-benzo[b]thiophene-6-sulfonic acid amide | CHEMBL195947
Type:
Small organic molecule
Emp. Form.:
C9H9NO4S2
Mol. Mass.:
259.302
SMILES:
CC1=CS(=O)(=O)c2cc(ccc12)S(N)(=O)=O
: