Target
Carbonic anhydrase 1
Ligand
BDBM50173866
Substrate
Meas. Tech.
ChEMBL_320715 (CHEMBL881701)
Ki
>1000±n/a nM
Citation
 Innocenti, AVillar, RMartinez-Merino, VGil, MJScozzafava, AVullo, DSupuran, CT Carbonic anhydrase inhibitors: inhibition of cytosolic/tumor-associated carbonic anhydrase isozymes I, II, and IX with benzo[b]thiophene 1,1-dioxide sulfonamides. Bioorg Med Chem Lett 15:4872-6 (2005)  
Target
Name:
Carbonic anhydrase 1
Synonyms:
CA-I CAB Carbonate dehydratase I Carbonic anhydrase 1 (CA I) Carbonic anhydrase 1 (Recombinant CA I) Carbonic anhydrase B Carbonic anhydrase I (CA I) Carbonic anhydrase I (CAI) Carbonic anhydrase isoenzyme I (hCA I) | hCA
Type:
Enzyme
Mol. Mass.:
28873.37
Organism:
Homo sapiens (Human)
Description:
P00915
Residue:
261
  
Inhibitor
Name:
BDBM50173866
Synonyms:
1,1-Dioxo-1H-1lambda*6*-benzo[b]thiophene-5-sulfonic acid (3-methoxy-phenyl)-amide | CHEMBL370329
Type:
Small organic molecule
Emp. Form.:
C15H13NO5S2
Mol. Mass.:
351.397
SMILES:
COc1cccc(NS(=O)(=O)c2ccc3c(C=CS3(=O)=O)c2)c1
: