Target
Carbonic anhydrase 2
Ligand
BDBM50173871
Substrate
Meas. Tech.
ChEMBL_320716 (CHEMBL881702)
Ki
7.4±n/a nM
Citation
 Innocenti, AVillar, RMartinez-Merino, VGil, MJScozzafava, AVullo, DSupuran, CT Carbonic anhydrase inhibitors: inhibition of cytosolic/tumor-associated carbonic anhydrase isozymes I, II, and IX with benzo[b]thiophene 1,1-dioxide sulfonamides. Bioorg Med Chem Lett 15:4872-6 (2005)  
Target
Name:
Carbonic anhydrase 2
Synonyms:
CA-II CAC Carbonate dehydratase II Carbonic anhydrase 2 (CA-II) Carbonic anhydrase C Carbonic anhydrase II (CA-II) Carbonic anhydrase II (hCA II) | Carbonic anhydrase isoenzyme II (hCA II)
Type:
Enzyme
Mol. Mass.:
29250.71
Organism:
Homo sapiens (Human)
Description:
P00918
Residue:
260
  
Inhibitor
Name:
BDBM50173871
Synonyms:
1,1-Dioxo-1H-1lambda*6*-benzo[b]thiophene-5-sulfonic acid amide | CHEMBL195035
Type:
Small organic molecule
Emp. Form.:
C8H7NO4S2
Mol. Mass.:
245.275
SMILES:
NS(=O)(=O)c1ccc2c(C=CS2(=O)=O)c1
: