Target
Delta-type opioid receptor
Ligand
BDBM50174200
Substrate
Meas. Tech.
ChEMBL_326600 (CHEMBL863373)
Ki
0.13±n/a nM
Citation
 Li, TShiotani, KMiyazaki, AFujita, YTsuda, YAmbo, ASasaki, YJinsmaa, YMarczak, EBryant, SDLazarus, LHOkada, Y New series of potent delta-opioid antagonists containing the H-Dmt-Tic-NH-hexyl-NH-R motif. Bioorg Med Chem Lett 15:5517-20 (2005)  
Target
Name:
Delta-type opioid receptor
Synonyms:
Cytochrome P450 3A4 Delta opioid receptor Delta-type opioid receptor (DOR) OPRD_RAT Opioid receptor Opioid receptors; mu & delta Ror-a | Voltage-gated potassium channel
Type:
G Protein-Coupled Receptor (GPCR)
Mol. Mass.:
40465.04
Organism:
Rattus norvegicus (rat)
Description:
Competition binding assays were using CHO-K1 cell membranes expressing the opioid receptor.
Residue:
372
  
Inhibitor
Name:
BDBM50174200
Synonyms:
CHEMBL380590 | H-Dmt-Tic-NH-(CH2)6-NH-Tic-H
Type:
Small organic molecule
Emp. Form.:
C37H47N5O4
Mol. Mass.:
625.8002
SMILES:
Cc1cc(O)cc(C)c1C[C@H](N)C(=O)N1Cc2ccccc2CC1C(=O)NCCCCCCNC(=O)C1Cc2ccccc2CN1
: