Target
Adenosine kinase
Ligand
BDBM50174603
Substrate
Meas. Tech.
ChEMBL_321616 (CHEMBL872316)
IC50
1±n/a nM
Citation
 Boyer, SHUgarkar, BGSolbach, JKopcho, JMatelich, MCOllis, KGomez-Galeno, JEMendonca, RTsuchiya, MNagahisa, ANakane, MWiesner, JBErion, MD Adenosine kinase inhibitors. 5. Synthesis, enzyme inhibition, and analgesic activity of diaryl-erythro-furanosyltubercidin analogues. J Med Chem 48:6430-41 (2005)  
Target
Name:
Adenosine kinase
Synonyms:
ADK | ADK_HUMAN
Type:
PROTEIN
Mol. Mass.:
40545.97
Organism:
Homo sapiens (Human)
Description:
ChEMBL_1467841
Residue:
362
  
Inhibitor
Name:
BDBM50174603
Synonyms:
(1R,2R,3R)-2-[4-(2,3-Dihydro-benzo[1,4]dioxin-6-ylamino)-5-o-tolyl-pyrrolo[2,3-d]pyrimidin-7-yl]-tetrahydro-furan-3,4-diol | CHEMBL370218
Type:
Small organic molecule
Emp. Form.:
C25H24N4O5
Mol. Mass.:
460.4819
SMILES:
Cc1ccccc1-c1cn([C@@H]2OC[C@@H](O)[C@H]2O)c2ncnc(Nc3ccc4OCCOc4c3)c12
: