Target
Inosine-5'-monophosphate dehydrogenase 2
Ligand
BDBM50174780
Substrate
Meas. Tech.
ChEMBL_326856 (CHEMBL860455)
IC50
300±n/a nM
Citation
 Birch, HLBuckley, GMDavies, NDyke, HJFrost, EJGilbert, PJHannah, DRHaughan, AFMadigan, MJMorgan, TPitt, WRRatcliffe, AJRay, NCRichard, MDSharpe, ATaylor, AJWhitworth, JMWilliams, SC Novel 7-methoxy-6-oxazol-5-yl-2,3-dihydro-1H-quinazolin-4-ones as IMPDH inhibitors. Bioorg Med Chem Lett 15:5335-9 (2005)  
Target
Name:
Inosine-5'-monophosphate dehydrogenase 2
Synonyms:
IMDH2_HUMAN IMPD 2 IMPDH-II Inosine 5'-monophosphate dehydrogenase II (IMPDH II) Inosine-5 -monophosphate dehydrogenase 2 | Inosine-5'-monophosphate dehydrogenase (IMPDH)
Type:
Enzyme
Mol. Mass.:
55806.87
Organism:
Homo sapiens (Human)
Description:
Recombinant IMPDH2 expressed in E. coli.
Residue:
514
  
Inhibitor
Name:
BDBM50174780
Synonyms:
7-methoxy-2,2-dimethyl-6-(oxazol-5-yl)-3-(2-(pyridin-4-yl)ethyl)-2,3-dihydroquinazolin-4(1H)-one | CHEMBL198791
Type:
Small organic molecule
Emp. Form.:
C21H22N4O3
Mol. Mass.:
378.4244
SMILES:
COc1cc2NC(C)(C)N(CCc3ccncc3)C(=O)c2cc1-c1cnco1
: