Target
Inosine-5'-monophosphate dehydrogenase 2
Ligand
BDBM50174795
Substrate
Meas. Tech.
ChEMBL_326856 (CHEMBL860455)
IC50
68±n/a nM
Citation
 Birch, HLBuckley, GMDavies, NDyke, HJFrost, EJGilbert, PJHannah, DRHaughan, AFMadigan, MJMorgan, TPitt, WRRatcliffe, AJRay, NCRichard, MDSharpe, ATaylor, AJWhitworth, JMWilliams, SC Novel 7-methoxy-6-oxazol-5-yl-2,3-dihydro-1H-quinazolin-4-ones as IMPDH inhibitors. Bioorg Med Chem Lett 15:5335-9 (2005)  
Target
Name:
Inosine-5'-monophosphate dehydrogenase 2
Synonyms:
IMDH2_HUMAN IMPD 2 IMPDH-II Inosine 5'-monophosphate dehydrogenase II (IMPDH II) Inosine-5 -monophosphate dehydrogenase 2 | Inosine-5'-monophosphate dehydrogenase (IMPDH)
Type:
Enzyme
Mol. Mass.:
55806.87
Organism:
Homo sapiens (Human)
Description:
Recombinant IMPDH2 expressed in E. coli.
Residue:
514
  
Inhibitor
Name:
BDBM50174795
Synonyms:
7'-methoxy-3'-methyl-6'-(1,3-oxazol-5-yl)-1-[(piperidin-1-yl)carbonyl]-3',4'-dihydro-1'H-spiro[pyrrolidine-3,2'-quinazoline]-4'-one | CHEMBL198526
Type:
Small organic molecule
Emp. Form.:
C22H27N5O4
Mol. Mass.:
425.4809
SMILES:
COc1cc2NC3(CCN(C3)C(=O)N3CCCCC3)N(C)C(=O)c2cc1-c1cnco1
: