Target
Melanin-concentrating hormone receptor 2
Ligand
BDBM50174823
Substrate
Meas. Tech.
ChEMBL_326855 (CHEMBL860452)
Ki
>3000±n/a nM
Citation
 Palani, AShapiro, SMcBriar, MDClader, JWGreenlee, WJO'Neill, KHawes, B Biaryl diamides as potent melanin concentrating hormone receptor 1 antagonists. Bioorg Med Chem Lett 15:5234-6 (2005)  
Target
Name:
Melanin-concentrating hormone receptor 2
Synonyms:
GPR145 MCHR2_HUMAN Melanin-concentrating hormone receptor SLT
Type:
Enzyme Catalytic Domain
Mol. Mass.:
38862.16
Organism:
Homo sapiens (Human)
Description:
Melanin Concentrating Hormone 2 GPR145 HUMAN::Q969V1
Residue:
340
  
Inhibitor
Name:
BDBM50174823
Synonyms:
CHEMBL198968 | N-[(R)-1-(3'-cyano-biphenyl-4-yl)-ethyl]-N-[(3,5-dichloro-phenylcarbamoyl)-methyl]-3-((S)-3-hydroxy-pyrrolidin-1-yl)-propionamide
Type:
Small organic molecule
Emp. Form.:
C30H30Cl2N4O3
Mol. Mass.:
565.49
SMILES:
C[C@@H](N(CC(=O)Nc1cc(Cl)cc(Cl)c1)C(=O)CCN1CC[C@H](O)C1)c1ccc(cc1)-c1cccc(c1)C#N
: