Target
Tyrosine-protein kinase Lck
Ligand
BDBM50175211
Substrate
Meas. Tech.
ChEMBL_328617 (CHEMBL863865)
IC50
540±n/a nM
Citation
 Burchat, ABorhani, DWCalderwood, DJHirst, GCLi, BStachlewitz, RF Discovery of A-770041, a src-family selective orally active lck inhibitor that prevents organ allograft rejection. Bioorg Med Chem Lett 16:118-22 (2005)  
Target
Name:
Tyrosine-protein kinase Lck
Synonyms:
2.7.10.2 LCK_HUMAN Leukocyte C-terminal Src kinase Lymphocyte-specific protein tyrosine kinase Protein YT16 Proto-oncogene tyrosine-protein kinase LCK T cell-specific protein-tyrosine kinase
Type:
Mol. Mass.:
57987.83
Organism:
Homo sapiens (Human)
Description:
P06239
Residue:
509
  
Inhibitor
Name:
BDBM50175211
Synonyms:
CHEMBL373054 | N-(4-(4-amino-1-(1-benzylpiperidin-4-yl)-1H-pyrazolo[3,4-d]pyrimidin-3-yl)-2-methoxyphenyl)-2-fluoro-4-(trifluoromethyl)benzamide
Type:
Small organic molecule
Emp. Form.:
C32H29F4N7O2
Mol. Mass.:
619.612
SMILES:
COc1cc(ccc1NC(=O)c1ccc(cc1F)C(F)(F)F)-c1nn(C2CCN(Cc3ccccc3)CC2)c2ncnc(N)c12
: