Target
5-hydroxytryptamine receptor 1B
Ligand
BDBM50175489
Substrate
Meas. Tech.
ChEMBL_326566 (CHEMBL859777)
Ki
0.5±n/a nM
Citation
 Kling, ALange, UEMack, HBakker, MHDrescher, KUHornberger, WHutchins, CWMöller, AMüller, RSchmidt, MUnger, LWicke, KSchellhaas, KSteiner, G Synthesis and SAR of highly potent dual 5-HT1A and 5-HT1B antagonists as potential antidepressant drugs. Bioorg Med Chem Lett 15:5567-73 (2005)  
Target
Name:
5-hydroxytryptamine receptor 1B
Synonyms:
5-HT-1B 5-HT1B 5HT1B_HUMAN HTR1DB Serotonin (5-HT) receptor Serotonin Receptor 1B
Type:
G Protein-Coupled Receptor (GPCR)
Mol. Mass.:
43579.17
Organism:
Homo sapiens (Human)
Description:
Receptor binding assays were performed using human clone stably expressed in CHO cells
Residue:
390
  
Inhibitor
Name:
BDBM50175489
Synonyms:
7-methyl-3-[2-(4-naphthalen-1-yl-piperazin-1-yl)-ethyl]-5,6,7,8-tetrahydro-3H-pyrido[4',3':4,5]thieno[2,3-d]pyrimidin-4-one | CHEMBL198836
Type:
Small organic molecule
Emp. Form.:
C26H29N5OS
Mol. Mass.:
459.606
SMILES:
CN1CCc2c(C1)sc1ncn(CCN3CCN(CC3)c3cccc4ccccc34)c(=O)c21
: