Target
Delta-type opioid receptor
Ligand
BDBM50175734
Substrate
Meas. Tech.
ChEMBL_328876 (CHEMBL859855)
Ki
79±n/a nM
Citation
 Trabanco, AAPullan, SAlonso, JMAlvarez, RMAndrés, JIBoeckx, IFernández, JGómez, AIturrino, LJanssens, FELeenaerts, JEDe Lucas, AIMatesanz, EMeert, TSteckler, T 4-Phenyl-4-[1H-imidazol-2-yl]-piperidine derivatives, a novel class of selective delta-opioid agonists. Bioorg Med Chem Lett 16:146-9 (2005)  
Target
Name:
Delta-type opioid receptor
Synonyms:
D-OR-1 Delta opioid receptor OPIATE Delta OPRD1 OPRK1 | opioid receptor, delta 1
Type:
G Protein-Coupled Receptor (GPCR)
Mol. Mass.:
40382.98
Organism:
Homo sapiens (Human)
Description:
Competition binding assays were carried out using membrane preparations from transfected HN9.10 cells that constitutively expressed the delta opioid receptor.
Residue:
372
  
Inhibitor
Name:
BDBM50175734
Synonyms:
4-(1-benzyl-1H-imidazol-2-yl)-4-phenyl-1-(thiazol-2-yl)piperidine | CHEMBL436323
Type:
Small organic molecule
Emp. Form.:
C24H24N4S
Mol. Mass.:
400.539
SMILES:
C(c1ccccc1)n1ccnc1C1(CCN(CC1)c1nccs1)c1ccccc1
: