Target
Delta-type opioid receptor
Ligand
BDBM50175740
Substrate
Meas. Tech.
ChEMBL_328881 (CHEMBL860461)
EC50
436±n/a nM
Citation
 Trabanco, AAPullan, SAlonso, JMAlvarez, RMAndrés, JIBoeckx, IFernández, JGómez, AIturrino, LJanssens, FELeenaerts, JEDe Lucas, AIMatesanz, EMeert, TSteckler, T 4-Phenyl-4-[1H-imidazol-2-yl]-piperidine derivatives, a novel class of selective delta-opioid agonists. Bioorg Med Chem Lett 16:146-9 (2005)  
Target
Name:
Delta-type opioid receptor
Synonyms:
D-OR-1 Delta opioid receptor OPIATE Delta OPRD1 OPRK1 | opioid receptor, delta 1
Type:
G Protein-Coupled Receptor (GPCR)
Mol. Mass.:
40382.98
Organism:
Homo sapiens (Human)
Description:
Competition binding assays were carried out using membrane preparations from transfected HN9.10 cells that constitutively expressed the delta opioid receptor.
Residue:
372
  
Inhibitor
Name:
BDBM50175740
Synonyms:
4-(1-benzyl-1H-imidazol-2-yl)-N-(3-methoxyphenyl)-4-phenylpiperidine-1-carboxamide | CHEMBL200098
Type:
Small organic molecule
Emp. Form.:
C29H30N4O2
Mol. Mass.:
466.5741
SMILES:
COc1cccc(NC(=O)N2CCC(CC2)(c2nccn2Cc2ccccc2)c2ccccc2)c1
: