Target
Mu-type opioid receptor
Ligand
BDBM50175739
Substrate
Meas. Tech.
ChEMBL_328877 (CHEMBL859856)
Ki
>4652±n/a nM
Citation
 Trabanco, AAPullan, SAlonso, JMAlvarez, RMAndrés, JIBoeckx, IFernández, JGómez, AIturrino, LJanssens, FELeenaerts, JEDe Lucas, AIMatesanz, EMeert, TSteckler, T 4-Phenyl-4-[1H-imidazol-2-yl]-piperidine derivatives, a novel class of selective delta-opioid agonists. Bioorg Med Chem Lett 16:146-9 (2005)  
Target
Name:
Mu-type opioid receptor
Synonyms:
M-OR-1 MOR-1 MUOR1 Mu opiate receptor OPRM1 hMOP | mu-type opioid receptor isoform MOR-1
Type:
G Protein-Coupled Receptor (GPCR)
Mol. Mass.:
44789.51
Organism:
Homo sapiens (Human)
Description:
P35372
Residue:
400
  
Inhibitor
Name:
BDBM50175739
Synonyms:
4-(1-benzyl-1H-imidazol-2-yl)-1-(methylsulfonyl)-4-phenylpiperidine | CHEMBL200700
Type:
Small organic molecule
Emp. Form.:
C22H25N3O2S
Mol. Mass.:
395.518
SMILES:
CS(=O)(=O)N1CCC(CC1)(c1nccn1Cc1ccccc1)c1ccccc1
: