Target
Sodium- and chloride-dependent glycine transporter 1
Ligand
BDBM50175896
Substrate
Meas. Tech.
ChEMBL_329241 (CHEMBL865813)
EC50
630±n/a nM
Citation
 Pinard, ECeccarelli, SMStalder, HAlberati, D Discovery of N-(2-aryl-cyclohexyl) substituted spiropiperidines as a novel class of GlyT1 inhibitors. Bioorg Med Chem Lett 16:349-53 (2005)  
Target
Name:
Sodium- and chloride-dependent glycine transporter 1
Synonyms:
GlyT-1 Glycine Transporters (GlyT1c) SC6A9_HUMAN Sodium- and chloride-dependent glycine transporter 1 Sodium- and chloride-dependent glycine transporter 1 (GlyT1c) Solute carrier family 6 member 9
Type:
Enzyme
Mol. Mass.:
78270.54
Organism:
Homo sapiens (Human)
Description:
P48067
Residue:
706
  
Inhibitor
Name:
BDBM50175896
Synonyms:
1-cyclopentyl-8-((1S,2S)-2-phenyl-cyclohexyl)-1,3,8-triaza-spiro[4.5]decan-4-one | CHEMBL199571
Type:
Small organic molecule
Emp. Form.:
C24H35N3O
Mol. Mass.:
381.5542
SMILES:
O=C1NCN(C2CCCC2)C11CCN(CC1)[C@H]1CCCC[C@H]1c1ccccc1
: