Target
Sodium- and chloride-dependent glycine transporter 2
Ligand
BDBM50175900
Substrate
Meas. Tech.
ChEMBL_329242 (CHEMBL865815)
EC50
16000±n/a nM
Citation
 Pinard, ECeccarelli, SMStalder, HAlberati, D Discovery of N-(2-aryl-cyclohexyl) substituted spiropiperidines as a novel class of GlyT1 inhibitors. Bioorg Med Chem Lett 16:349-53 (2005)  
Target
Name:
Sodium- and chloride-dependent glycine transporter 2
Synonyms:
GLYT2 NET1 SLC6A5 | Sodium- and chloride-dependent glycine transporter 2
Type:
Enzyme Catalytic Domain
Mol. Mass.:
87438.56
Organism:
Homo sapiens (Human)
Description:
Glycine-2-transporter 0 HUMAN::Q9Y345
Residue:
797
  
Inhibitor
Name:
BDBM50175900
Synonyms:
8-[(1S,2S)-2-(4-fluoro-phenyl)-cyclohexyl]-1-phenyl-1,3,8-triaza-spiro[4.5]decan-4-one | CHEMBL199888
Type:
Small organic molecule
Emp. Form.:
C25H30FN3O
Mol. Mass.:
407.5236
SMILES:
Fc1ccc(cc1)[C@@H]1CCCC[C@@H]1N1CCC2(CC1)N(CNC2=O)c1ccccc1
: