Target
Nociceptin receptor
Ligand
BDBM50175902
Substrate
Meas. Tech.
ChEMBL_329244 (CHEMBL864596)
IC50
3700±n/a nM
Citation
 Pinard, ECeccarelli, SMStalder, HAlberati, D Discovery of N-(2-aryl-cyclohexyl) substituted spiropiperidines as a novel class of GlyT1 inhibitors. Bioorg Med Chem Lett 16:349-53 (2005)  
Target
Name:
Nociceptin receptor
Synonyms:
KOR-3 Mu-type opioid receptor (Mu) Nociceptin Receptor (ORL1 Receptor) Nociceptin receptor (ORL-1) Nociceptin/Orphanin FQ, NOP receptor OPIATE ORL-1 OPRL1 protein ORL1 Opioid receptor like-1 Orphanin FQ receptor (ORL1) | P41146
Type:
G Protein-Coupled Receptor (GPCR)
Mol. Mass.:
40702.87
Organism:
Homo sapiens (Human)
Description:
P41146
Residue:
370
  
Inhibitor
Name:
BDBM50175902
Synonyms:
1-phenyl-8-((cis,1R,2R)-2-phenyl-cyclohexyl)-1,3,8-triaza-spiro[4.5]decan-4-one | CHEMBL383539
Type:
Small organic molecule
Emp. Form.:
C25H31N3O
Mol. Mass.:
389.5331
SMILES:
O=C1NCN(c2ccccc2)C11CCN(CC1)[C@@H]1CCCC[C@@H]1c1ccccc1
: