Target
Mu-type opioid receptor
Ligand
BDBM50175907
Substrate
Meas. Tech.
ChEMBL_329245 (CHEMBL864595)
IC50
2200±n/a nM
Citation
 Pinard, ECeccarelli, SMStalder, HAlberati, D Discovery of N-(2-aryl-cyclohexyl) substituted spiropiperidines as a novel class of GlyT1 inhibitors. Bioorg Med Chem Lett 16:349-53 (2005)  
Target
Name:
Mu-type opioid receptor
Synonyms:
M-OR-1 MOR-1 MUOR1 Mu opiate receptor OPRM1 hMOP | mu-type opioid receptor isoform MOR-1
Type:
G Protein-Coupled Receptor (GPCR)
Mol. Mass.:
44789.51
Organism:
Homo sapiens (Human)
Description:
P35372
Residue:
400
  
Inhibitor
Name:
BDBM50175907
Synonyms:
1-pentyl-8-((1S,2S)-2-phenyl-cyclohexyl)-1,3,8-triaza-spiro[4.5]decan-4-one | CHEMBL200728
Type:
Small organic molecule
Emp. Form.:
C24H37N3O
Mol. Mass.:
383.5701
SMILES:
CCCCCN1CNC(=O)C11CCN(CC1)[C@H]1CCCC[C@H]1c1ccccc1
: