Target
D(2) dopamine receptor
Ligand
BDBM50176034
Substrate
Meas. Tech.
ChEMBL_320895 (CHEMBL872394)
Ki
4.3±n/a nM
Citation
 Smid, PCoolen, HKKeizer, HGvan Hes, Rde Moes, JPden Hartog, APStork, BPlekkenpol, RHNiemann, LCStroomer, CNTulp, MTvan Stuivenberg, HHMcCreary, ACHesselink, MBHerremans, AHKruse, CG Synthesis, structure-activity relationships, and biological properties of 1-heteroaryl-4-[omega-(1H-indol-3-yl)alkyl]piperazines, novel potential antipsychotics combining potent dopamine D2 receptor antagonism with potent serotonin reuptake inhibition. J Med Chem 48:6855-69 (2005)  
Target
Name:
D(2) dopamine receptor
Synonyms:
D(2) dopamine receptor DOPAMINE D2 Long DRD2 Dopamine D2 receptor Dopamine D2 receptor (D2R) Dopamine2-like | d2
Type:
Cell-surface receptors
Mol. Mass.:
50647.10
Organism:
Homo sapiens (Human)
Description:
P14416
Residue:
443
  
Inhibitor
Name:
BDBM50176034
Synonyms:
8-{4-[3-(1H-Indol-3-yl)-propyl]-piperazin-1-yl}-4H-benzo[1,4]oxazin-3-one | CHEMBL198069
Type:
Small organic molecule
Emp. Form.:
C23H26N4O2
Mol. Mass.:
390.4781
SMILES:
O=C1COc2c(N1)cccc2N1CCN(CCCc2c[nH]c3ccccc23)CC1
: