Target
Coagulation factor X
Ligand
BDBM16303
Substrate
Meas. Tech.
ChEMBL_334349 (CHEMBL862208)
Ki
1±n/a nM
Citation
 Young, WBSprengeler, PShrader, WDLi, YRai, RVerner, EJenkins, TFatheree, PKolesnikov, AJanc, JWCregar, LElrod, KKatz, B Generation of potent coagulation protease inhibitors utilizing zinc-mediated chelation. Bioorg Med Chem Lett 16:710-3 (2005)  
Target
Name:
Coagulation factor X
Synonyms:
Activated coagulation factor X (FXa) Coagulation factor X precursor F10 Factor X heavy chain Factor Xa Stuart-Prower factor
Type:
Enzyme
Mol. Mass.:
54726.60
Organism:
Homo sapiens (Human)
Description:
Residue:
488
  
Inhibitor
Name:
BDBM16303
Synonyms:
2-(1H-1,3-benzodiazol-2-ylmethyl)-1H-1,3-benzodiazole-6-carboximidamide APD-1 | CHEMBL46148
Type:
Small organic molecule
Emp. Form.:
C16H14N6
Mol. Mass.:
290.3226
SMILES:
NC(=N)c1ccc2nc(Cc3nc4ccccc4[nH]3)[nH]c2c1
: