Target
Coagulation factor X
Ligand
BDBM50176251
Substrate
Meas. Tech.
ChEMBL_334349 (CHEMBL862208)
Ki
1±n/a nM
Citation
 Young, WBSprengeler, PShrader, WDLi, YRai, RVerner, EJenkins, TFatheree, PKolesnikov, AJanc, JWCregar, LElrod, KKatz, B Generation of potent coagulation protease inhibitors utilizing zinc-mediated chelation. Bioorg Med Chem Lett 16:710-3 (2005)  
Target
Name:
Coagulation factor X
Synonyms:
Activated coagulation factor X (FXa) Coagulation factor X precursor F10 Factor X heavy chain Factor Xa Stuart-Prower factor
Type:
Enzyme
Mol. Mass.:
54726.60
Organism:
Homo sapiens (Human)
Description:
Residue:
488
  
Inhibitor
Name:
BDBM50176251
Synonyms:
2-((6-chloro-1H-benzo[d]imidazol-2-yl)methyl)-1H-benzo[d]imidazole-5-carboxamidine | CHEMBL204260
Type:
Small organic molecule
Emp. Form.:
C16H13ClN6
Mol. Mass.:
324.768
SMILES:
NC(=N)c1ccc2nc(Cc3nc4ccc(Cl)cc4[nH]3)[nH]c2c1
: