Target
5-hydroxytryptamine receptor 2C
Ligand
BDBM50176272
Substrate
Meas. Tech.
ChEMBL_331166 (CHEMBL854093)
EC50
2.9±n/a nM
Citation
 Adams, DRBentley, JMBenwell, KRBickerdike, MJBodkin, CDCliffe, IADourish, CTGeorge, ARKennett, GAKnight, ARMalcolm, CSMansell, HLMisra, AQuirk, KRoffey, JRVickers, SP Pyrrolo(iso)quinoline derivatives as 5-HT(2C) receptor agonists. Bioorg Med Chem Lett 16:677-80 (2005)  
Target
Name:
5-hydroxytryptamine receptor 2C
Synonyms:
5-HT-2C 5-HT2C-INI 5-HTR2C 5-hydroxytryptamine receptor 2C (5-HT-2C) 5HT-1C HTR1C Serotonin (5-HT3) receptor Serotonin Receptor 2C
Type:
G Protein-Coupled Receptor (GPCR)
Mol. Mass.:
51836.79
Organism:
Homo sapiens (Human)
Description:
P28335
Residue:
458
  
Inhibitor
Name:
BDBM50176272
Synonyms:
(S)-1-(1H-pyrrolo[2,3-f]quinolin-1-yl)propan-2-amine VER-2692
Type:
Small organic molecule
Emp. Form.:
C14H15N3
Mol. Mass.:
225.289
SMILES:
C[C@H](N)Cn1ccc2ccc3ncccc3c12
: