Target
Cannabinoid receptor 1
Ligand
BDBM50176404
Substrate
Meas. Tech.
ChEMBL_333262 (CHEMBL859083)
Ki
4±n/a nM
Citation
 Carpino, PAGriffith, DASakya, SDow, RLBlack, SCHadcock, JRIredale, PAScott, DOFichtner, MWRose, CRDay, RDibrino, JButler, MDebartolo, DBDutcher, DGautreau, DLizano, JSO'connor, RESands, MAKelly-Sullivan, DWard, KM New bicyclic cannabinoid receptor-1 (CB1-R) antagonists. Bioorg Med Chem Lett 16:731-6 (2005)  
Target
Name:
Cannabinoid receptor 1
Synonyms:
CANN6 CB-R CNR CNR1_HUMAN Cannabinoid receptor Cannabinoid receptor 1 (brain)
Type:
G Protein-Coupled Receptor (GPCR)
Mol. Mass.:
52868.96
Organism:
Homo sapiens (Human)
Description:
P21554
Residue:
472
  
Inhibitor
Name:
BDBM50176404
Synonyms:
2-(2-chlorophenyl)-3-(4-chlorophenyl)-6-(2,2,2-trifluoroethyl)-2H-pyrazolo[3,4-d]pyridazin-7(6H)-one | CHEMBL381858
Type:
Small organic molecule
Emp. Form.:
C19H11Cl2F3N4O
Mol. Mass.:
439.218
SMILES:
FC(F)(F)Cn1ncc2c(-c3ccc(Cl)cc3)n(nc2c1=O)-c1ccccc1Cl
: