Target
D(2) dopamine receptor
Ligand
BDBM50176441
Substrate
Meas. Tech.
ChEMBL_332997 (CHEMBL853595)
Ki
151±n/a nM
Citation
 Geneste, HBackfisch, GBraje, WDelzer, JHaupt, AHutchins, CWKing, LLLubisch, WSteiner, GTeschendorf, HJUnger, LWernet, W Synthesis and SAR of highly potent and selective dopamine D(3)-receptor antagonists: Quinolin(di)one and benzazepin(di)one derivatives. herve.geneste@abbott.com. Bioorg Med Chem Lett 16:658-62 (2005)  
Target
Name:
D(2) dopamine receptor
Synonyms:
D(2) dopamine receptor DOPAMINE D2 Long DRD2 Dopamine D2 receptor Dopamine D2 receptor (D2R) Dopamine2-like | d2
Type:
Cell-surface receptors
Mol. Mass.:
50647.10
Organism:
Homo sapiens (Human)
Description:
P14416
Residue:
443
  
Inhibitor
Name:
BDBM50176441
Synonyms:
1-(4-(4-(2-tert-butyl-6-(trifluoromethyl)pyrimidin-4-yl)piperazin-1-yl)butyl)quinolin-2(1H)-one | CHEMBL201743
Type:
Small organic molecule
Emp. Form.:
C26H32F3N5O
Mol. Mass.:
487.5604
SMILES:
CC(C)(C)c1nc(cc(n1)C(F)(F)F)N1CCN(CCCCn2c3ccccc3ccc2=O)CC1
: