Target
D(3) dopamine receptor
Ligand
BDBM50176449
Substrate
Meas. Tech.
ChEMBL_332996 (CHEMBL853593)
Ki
58.9±n/a nM
Citation
 Geneste, HBackfisch, GBraje, WDelzer, JHaupt, AHutchins, CWKing, LLLubisch, WSteiner, GTeschendorf, HJUnger, LWernet, W Synthesis and SAR of highly potent and selective dopamine D(3)-receptor antagonists: Quinolin(di)one and benzazepin(di)one derivatives. herve.geneste@abbott.com. Bioorg Med Chem Lett 16:658-62 (2005)  
Target
Name:
D(3) dopamine receptor
Synonyms:
DOPAMINE D3 DRD3_HUMAN Dopamine D3 receptor (D3) Dopamine receptor Dopamine receptor D3
Type:
Mol. Mass.:
44243.43
Organism:
Homo sapiens (Human)
Description:
Residue:
400
  
Inhibitor
Name:
BDBM50176449
Synonyms:
1-(4-(4-(2-tert-butyl-6-(trifluoromethyl)pyrimidin-4-yl)piperazin-1-yl)-2-methylbut-2-enyl)-3,4-dihydroquinolin-2(1H)-one | CHEMBL201400
Type:
Small organic molecule
Emp. Form.:
C27H34F3N5O
Mol. Mass.:
501.587
SMILES:
C\C(CN1C(=O)CCc2ccccc12)=C/CN1CCN(CC1)c1cc(nc(n1)C(C)(C)C)C(F)(F)F
: