Target
Caspase-1
Ligand
BDBM50176496
Substrate
Meas. Tech.
ChEMBL_332180 (CHEMBL869995)
Ki
5±n/a nM
Citation
 Fahr, BTO'Brien, TPham, PWaal, NDBaskaran, SRaimundo, BCLam, JWSopko, MMPurkey, HERomanowski, MJ Tethering identifies fragment that yields potent inhibitors of human caspase-1. Bioorg Med Chem Lett 16:559-62 (2005)  
Target
Name:
Caspase-1
Synonyms:
CASP1 Caspase ICE IL1BCE Interleukin-1 beta-converting enzyme
Type:
Enzyme
Mol. Mass.:
45154.13
Organism:
Homo sapiens (Human)
Description:
P29466
Residue:
404
  
Inhibitor
Name:
BDBM50176496
Synonyms:
(3S)-3-(6-(4-(6-methylquinoxalin-2-ylamino)benzamido)-2-(thiophen-2-yl)hexanamido)-4-oxobutanoic acid | CHEMBL373061
Type:
Small organic molecule
Emp. Form.:
C30H31N5O5S
Mol. Mass.:
573.663
SMILES:
Cc1ccc2nc(Nc3ccc(cc3)C(=O)NCCCCC(C(=O)N[C@@H](CC(O)=O)C=O)c3cccs3)cnc2c1
: