Target
Caspase-1
Ligand
BDBM50176504
Substrate
Meas. Tech.
ChEMBL_332180 (CHEMBL869995)
Ki
54±n/a nM
Citation
 Fahr, BTO'Brien, TPham, PWaal, NDBaskaran, SRaimundo, BCLam, JWSopko, MMPurkey, HERomanowski, MJ Tethering identifies fragment that yields potent inhibitors of human caspase-1. Bioorg Med Chem Lett 16:559-62 (2005)  
Target
Name:
Caspase-1
Synonyms:
CASP1 Caspase ICE IL1BCE Interleukin-1 beta-converting enzyme
Type:
Enzyme
Mol. Mass.:
45154.13
Organism:
Homo sapiens (Human)
Description:
P29466
Residue:
404
  
Inhibitor
Name:
BDBM50176504
Synonyms:
(3S)-3-(6-(4-(6-chloropyrazin-2-ylamino)benzamido)-2-(thiophen-2-yl)hexanamido)-4-oxobutanoic acid | CHEMBL201910
Type:
Small organic molecule
Emp. Form.:
C25H26ClN5O5S
Mol. Mass.:
544.022
SMILES:
OC(=O)C[C@H](NC(=O)C(CCCCNC(=O)c1ccc(Nc2cncc(Cl)n2)cc1)c1cccs1)C=O
: