Target
Caspase-1
Ligand
BDBM50176492
Substrate
Meas. Tech.
ChEMBL_332180 (CHEMBL869995)
Ki
37000±n/a nM
Citation
 Fahr, BTO'Brien, TPham, PWaal, NDBaskaran, SRaimundo, BCLam, JWSopko, MMPurkey, HERomanowski, MJ Tethering identifies fragment that yields potent inhibitors of human caspase-1. Bioorg Med Chem Lett 16:559-62 (2005)  
Target
Name:
Caspase-1
Synonyms:
CASP1 Caspase ICE IL1BCE Interleukin-1 beta-converting enzyme
Type:
Enzyme
Mol. Mass.:
45154.13
Organism:
Homo sapiens (Human)
Description:
P29466
Residue:
404
  
Inhibitor
Name:
BDBM50176492
Synonyms:
(S)-4-oxo-3-(6-(4-(pyrazin-2-ylamino)benzamido)hexanamido)butanoic acid | CHEMBL382284
Type:
Small organic molecule
Emp. Form.:
C21H25N5O5
Mol. Mass.:
427.4537
SMILES:
OC(=O)C[C@H](NC(=O)CCCCCNC(=O)c1ccc(Nc2cnccn2)cc1)C=O
: