Target
High affinity cAMP-specific and IBMX-insensitive 3',5'-cyclic phosphodiesterase 8B
Ligand
BDBM28393
Substrate
Meas. Tech.
ChEMBL_327544 (CHEMBL854359)
IC50
>16000±n/a nM
Citation
 Chambers, RJAbrams, KGarceau, NYKamath, AVManley, CMLilley, SCOtte, DAScott, DOSheils, ALTess, DAVellekoop, ASZhang, YLam, KT A new chemical tool for exploring the physiological function of the PDE2 isozyme. Bioorg Med Chem Lett 16:307-10 (2005)  
Target
Name:
High affinity cAMP-specific and IBMX-insensitive 3',5'-cyclic phosphodiesterase 8B
Synonyms:
PDE8B Phosphodiesterase 8 | Phosphodiesterase 8B
Type:
PROTEIN
Mol. Mass.:
98984.88
Organism:
Homo sapiens (Human)
Description:
ChEMBL_876321
Residue:
885
  
Inhibitor
Name:
BDBM28393
Synonyms:
(+)-EHNA CHEMBL296435
Type:
Small organic molecule
Emp. Form.:
C14H23N5O
Mol. Mass.:
277.3653
SMILES:
CCCCCC[C@H]([C@H](C)O)n1cnc2c(N)ncnc12
: