Target
Adenosine receptor A1
Ligand
BDBM50176820
Substrate
Meas. Tech.
ChEMBL_430784 (CHEMBL920040)
Ki
109±n/a nM
Citation
 Manetti, FSchenone, SBondavalli, FBrullo, CBruno, ORanise, AMosti, LMenozzi, GFossa, PTrincavelli, MLMartini, CMartinelli, ATintori, CBotta, M Synthesis and 3D QSAR of new pyrazolo[3,4-b]pyridines: potent and selective inhibitors of A1 adenosine receptors. J Med Chem 48:7172-85 (2005)  
Target
Name:
Adenosine receptor A1
Synonyms:
AA1R_BOVIN ADENOSINE A1 high ADORA1 | Adenosine A1 receptor
Type:
Enzyme Catalytic Domain
Mol. Mass.:
36602.99
Organism:
BOVINE
Description:
ADENOSINE 0 BOVINE::P28190
Residue:
326
  
Inhibitor
Name:
BDBM50176820
Synonyms:
4-butyl-5-(4-cyclopropylbut-1-en-2-yl)-1-(2-phenylpropyl)-1H-indene | CHEMBL375885
Type:
Small organic molecule
Emp. Form.:
C22H25ClN4O2
Mol. Mass.:
412.913
SMILES:
CCCNc1c(cnc2n(CC(Cl)c3ccccc3)ncc12)C(=O)OCC1CC1
: