Target
Adenosine receptor A1
Ligand
BDBM50176830
Substrate
Meas. Tech.
ChEMBL_430784 (CHEMBL920040)
Ki
88±n/a nM
Citation
 Manetti, FSchenone, SBondavalli, FBrullo, CBruno, ORanise, AMosti, LMenozzi, GFossa, PTrincavelli, MLMartini, CMartinelli, ATintori, CBotta, M Synthesis and 3D QSAR of new pyrazolo[3,4-b]pyridines: potent and selective inhibitors of A1 adenosine receptors. J Med Chem 48:7172-85 (2005)  
Target
Name:
Adenosine receptor A1
Synonyms:
AA1R_BOVIN ADENOSINE A1 high ADORA1 | Adenosine A1 receptor
Type:
Enzyme Catalytic Domain
Mol. Mass.:
36602.99
Organism:
BOVINE
Description:
ADENOSINE 0 BOVINE::P28190
Residue:
326
  
Inhibitor
Name:
BDBM50176830
Synonyms:
CHEMBL391004 | methyl 1-(2-chloro-2-phenylethyl)-4-(phenethylamino)-1H-pyrazolo[3,4-b]pyridine-5-carboxylate
Type:
Small organic molecule
Emp. Form.:
C24H23ClN4O2
Mol. Mass.:
434.918
SMILES:
COC(=O)c1cnc2n(CC(Cl)c3ccccc3)ncc2c1NCCc1ccccc1
: