Target
Adenosine receptor A1
Ligand
BDBM50176833
Substrate
Meas. Tech.
ChEMBL_430786 (CHEMBL920042)
Ki
94±n/a nM
Citation
 Manetti, FSchenone, SBondavalli, FBrullo, CBruno, ORanise, AMosti, LMenozzi, GFossa, PTrincavelli, MLMartini, CMartinelli, ATintori, CBotta, M Synthesis and 3D QSAR of new pyrazolo[3,4-b]pyridines: potent and selective inhibitors of A1 adenosine receptors. J Med Chem 48:7172-85 (2005)  
Target
Name:
Adenosine receptor A1
Synonyms:
A1 adenosine receptor (hA1) AA1R_HUMAN ADORA1 Adenosine A1-receptor Adenosine receptor A1 (hA1) | Adenosine transporter (AdT)
Type:
G Protein-Coupled Receptor (GPCR)
Mol. Mass.:
36520.92
Organism:
Homo sapiens (Human)
Description:
P30542
Residue:
326
  
Inhibitor
Name:
BDBM50176833
Synonyms:
CHEMBL224545 | methyl 4-(4-methoxyphenethylamino)-1-(2-chloro-2-phenylethyl)-1H-pyrazolo[3,4-b]pyridine-5-carboxylate
Type:
Small organic molecule
Emp. Form.:
C25H25ClN4O3
Mol. Mass.:
464.944
SMILES:
COC(=O)c1cnc2n(CC(Cl)c3ccccc3)ncc2c1NCCc1ccc(OC)cc1
: