Target
Adenosine receptor A2a
Ligand
BDBM50176849
Substrate
Meas. Tech.
ChEMBL_430787 (CHEMBL920043)
Ki
1517±n/a nM
Citation
 Manetti, FSchenone, SBondavalli, FBrullo, CBruno, ORanise, AMosti, LMenozzi, GFossa, PTrincavelli, MLMartini, CMartinelli, ATintori, CBotta, M Synthesis and 3D QSAR of new pyrazolo[3,4-b]pyridines: potent and selective inhibitors of A1 adenosine receptors. J Med Chem 48:7172-85 (2005)  
Target
Name:
Adenosine receptor A2a
Synonyms:
A2A adenosine receptor (hA2A) ADENOSINE A2 ADORA2 Adenosine A2A receptor (A2AAR)
Type:
G Protein-Coupled Receptor (GPCR)
Mol. Mass.:
44716.46
Organism:
Homo sapiens (Human)
Description:
P29274
Residue:
412
  
Inhibitor
Name:
BDBM50176849
Synonyms:
CHEMBL427255 | isopropyl 1-(2-chloro-2-phenylethyl)-4-(phenethylamino)-1H-pyrazolo[3,4-b]pyridine-5-carboxylate
Type:
Small organic molecule
Emp. Form.:
C26H27ClN4O2
Mol. Mass.:
462.971
SMILES:
CC(C)OC(=O)c1cnc2n(CC(Cl)c3ccccc3)ncc2c1NCCc1ccccc1
: