Target
Melanin-concentrating hormone receptor 1
Ligand
BDBM50177294
Substrate
Meas. Tech.
ChEMBL_334678 (CHEMBL853090)
IC50
>10000±n/a nM
Citation
 Ulven, TLittle, PBReceveur, JMFrimurer, TMRist, ONørregaard, PKHögberg, T 6-Acylamino-2-amino-4-methylquinolines as potent melanin-concentrating hormone 1 receptor antagonists: structure-activity exploration of eastern and western parts. Bioorg Med Chem Lett 16:1070-5 (2006)  
Target
Name:
Melanin-concentrating hormone receptor 1
Synonyms:
G-protein coupled receptor 24 MCH receptor 1 MCH-R1 MCHR-1 MCHR1_HUMAN Melanin-Concentrating Hormone Receptor 1 (MCH1R) Melanin-concentrating hormone receptor 1 (MCH-1) Melanin-concentrating hormone receptor 1 (MCHR-1) SLC-1 Somatostatin receptor-like protein
Type:
G Protein-Coupled Receptor (GPCR)
Mol. Mass.:
45976.27
Organism:
Homo sapiens (Human)
Description:
Membranes from CHO-K1 cells stably expressing human MCH1R were used in assays.
Residue:
422
  
Inhibitor
Name:
BDBM50177294
Synonyms:
CHEMBL426481 | rac-N-(2-((2-(dimethylamino)ethyl)(methyl)amino)-4-methylquinolin-6-yl)-2-phenylcyclopropanecarboxamide
Type:
Small organic molecule
Emp. Form.:
C25H30N4O
Mol. Mass.:
402.5319
SMILES:
CN(C)CCN(C)c1cc(C)c2cc(NC(=O)C3CC3c3ccccc3)ccc2n1
: