Target
Matrix metalloproteinase-9
Ligand
BDBM50177311
Substrate
Meas. Tech.
ChEMBL_334536 (CHEMBL862519)
Ki
>2128±n/a nM
Citation
 Cherney, RJKing, BWGilmore, JLLiu, RQCovington, MBDuan, JJDecicco, CP Conversion of potent MMP inhibitors into selective TACE inhibitors. Bioorg Med Chem Lett 16:1028-31 (2006)  
Target
Name:
Matrix metalloproteinase-9
Synonyms:
67 kDa matrix metalloproteinase-9 92 kDa gelatinase CLG4B Gelatinase B MMP9 Matrix metalloproteinase 9 (MMP-9) Matrix metalloproteinase-9 (MMP9)
Type:
Enzyme
Mol. Mass.:
78452.28
Organism:
Homo sapiens (Human)
Description:
P14780
Residue:
707
  
Inhibitor
Name:
BDBM50177311
Synonyms:
2-{2-[4-(2-methyl-quinolin-4-ylmethoxy)-phenyl]-ethyl}-1,1-dioxo-isothiazolidine-3-carboxylic acid hydroxyamide | CHEMBL204549
Type:
Small organic molecule
Emp. Form.:
C23H25N3O5S
Mol. Mass.:
455.527
SMILES:
Cc1cc(COc2ccc(CCN3C(CCS3(=O)=O)C(=O)NO)cc2)c2ccccc2n1
: